{"text_format":"1","workbook":"xlsx","n_sheets":4,"sheets":["Reporting","Task list","Reports","How to use this template"],"not_rendered":{"charts":4,"images":1,"macros":1,"external_links":0,"defined_names":1,"comments":0,"pivot_tables":4},"unopened":[],"bounds":{"document_bytes":16777216,"sheet_cells":100000,"rows_first":2000,"rows_last":500,"rows_between":2000,"halvings":0,"cell_chars":16384,"cell_head_chars":4096},"cells_cut":0,"cells_raw":0,"read":"whole","date_system":"1900"}

{"sheet":"Reporting","index":0,"n_rows":0,"n_cols":0,"rows_kept":0,"cut":false,"hidden":false,"merged":[]}

{"sheet":"Task list","index":1,"n_rows":504,"n_cols":9,"rows_kept":504,"cut":false,"hidden":false,"merged":[[2,1,3,1],[1,2,1,5]]}
[]
[null,"Project Name","<insert project name here>"]
[null,"Current Task Statuses","Not Started","In Progress","Complete","Overdue"]
[null,null,{"$f":"COUNTIF($F$11:$F$504,C3)/COUNTIF($F$11:$F$504,\"*\")","v":0.36363636363636365},{"$f":"COUNTIF($F$11:$F$504,D3)/COUNTIF($F$11:$F$504,\"*\")","v":9.0909090909090912E-2},0.45454545454545453,9.0909090909090912E-2]
[]
[null,null,"Budget",{"$f":"C8-D8","v":-9.7400000000000091}]
[null,null,"Planned","Actual"]
[null,null,{"$f":"SUM($G$11:$G$504)","v":1078.26},{"$f":"SUM($H$11:$H$504)","v":1088}]
[]
["Tasks","Assigned To","Start","End","Days","Status","Planned Cost","Actual Cost","Notes"]
["Choose Event Time","Stacy Williams","2016-02-01","2016-02-01",{"$f":"IF(C11=\"\",\"\",IF(D11=\"\",\"\",D11-C11))","v":0},"Complete"]
["Create Guest List","Bozo the Clown","2016-02-02","2016-02-03",{"$f":"IF(C12=\"\",\"\",IF(D12=\"\",\"\",D12-C12))","v":1},"Complete"]
["Create Invitations","Stacy Williams","2016-02-03","2016-02-07",{"$f":"IF(C13=\"\",\"\",IF(D13=\"\",\"\",D13-C13))","v":4},"Overdue",10]
["Purchase Invitation Gift","Jenny Smith","2016-02-04","2016-02-10",6,"Complete",250.26,290]
["Send Invitations","Stacy Williams","2016-02-11","2016-02-14",3,"Not Started",10,8]
["Hire Event Coordinator","Bozo the Clown","2016-02-03","2016-02-14",11,"Complete",250,200]
["Plan Event Details","Bozo the Clown","2016-02-03","2016-02-21",18,"In Progress"]
["Purchase Required Items","Jenny Smith","2016-02-21","2016-02-28",7,"Not started",258,280]
["Lock in Guest List","Stacy Williams","2016-03-01","2016-03-01",0,"Not started"]
["Finalize other Hires","Bozo the Clown","2016-02-03","2016-02-28",25,"Complete",300,310]
["Send Reminders","Stacy Williams","2016-03-07","2016-03-10",3,"Not started"]
["PARTY!","Everyone",null,null,""]
[null,null,null,null,""]
[null,null,null,null,""]
[null,null,null,null,""]
[null,null,null,null,""]
[null,null,null,null,""]
[null,null,null,null,""]
[null,null,null,null,""]
[null,null,null,null,""]
[null,null,null,null,""]
[null,null,null,null,""]
[null,null,null,null,""]
[null,null,null,null,""]
[null,null,null,null,""]
[null,null,null,null,""]
[null,null,null,null,""]
[null,null,null,null,""]
[null,null,null,null,""]
[null,null,null,null,""]
[null,null,null,null,""]
[null,null,null,null,""]
[null,null,null,null,""]
[null,null,null,null,""]
[null,null,null,null,""]
[null,null,null,null,""]
[null,null,null,null,""]
[null,null,null,null,""]
[null,null,null,null,""]
[null,null,null,null,""]
[null,null,null,null,""]
[null,null,null,null,""]
[null,null,null,null,""]
[null,null,null,null,""]
[null,null,null,null,""]
[null,null,null,null,""]
[null,null,null,null,""]
[null,null,null,null,""]
[null,null,null,null,""]
[null,null,null,null,""]
[null,null,null,null,""]
[null,null,null,null,""]
[null,null,null,null,""]
[null,null,null,null,""]
[null,null,null,null,""]
[null,null,null,null,""]
[null,null,null,null,""]
[null,null,null,null,""]
[null,null,null,null,""]
[null,null,null,null,""]
[null,null,null,null,""]
[null,null,null,null,""]
[null,null,null,null,""]
[null,null,null,null,""]
[null,null,null,null,""]
[null,null,null,null,""]
[null,null,null,null,{"$f":"IF(C77=\"\",\"\",IF(D77=\"\",\"\",D77-C77))","v":""}]
[null,null,null,null,""]
[null,null,null,null,""]
[null,null,null,null,""]
[null,null,null,null,""]
[null,null,null,null,""]
[null,null,null,null,""]
[null,null,null,null,""]
[null,null,null,null,""]
[null,null,null,null,""]
[null,null,null,null,""]
[null,null,null,null,""]
[null,null,null,null,""]
[null,null,null,null,""]
[null,null,null,null,""]
[null,null,null,null,""]
[null,null,null,null,""]
[null,null,null,null,""]
[null,null,null,null,""]
[null,null,null,null,""]
[null,null,null,null,""]
[null,null,null,null,""]
[null,null,null,null,""]
[null,null,null,null,""]
[null,null,null,null,""]
[null,null,null,null,""]
[null,null,null,null,""]
[null,null,null,null,""]
[null,null,null,null,""]
[null,null,null,null,""]
[null,null,null,null,""]
[null,null,null,null,""]
[null,null,null,null,""]
[null,null,null,null,""]
[null,null,null,null,""]
[null,null,null,null,""]
[null,null,null,null,""]
[null,null,null,null,""]
[null,null,null,null,""]
[null,null,null,null,""]
[null,null,null,null,""]
[null,null,null,null,""]
[null,null,null,null,""]
[null,null,null,null,""]
[null,null,null,null,""]
[null,null,null,null,""]
[null,null,null,null,""]
[null,null,null,null,""]
[null,null,null,null,""]
[null,null,null,null,""]
[null,null,null,null,""]
[null,null,null,null,""]
[null,null,null,null,""]
[null,null,null,null,""]
[null,null,null,null,""]
[null,null,null,null,""]
[null,null,null,null,""]
[null,null,null,null,""]
[null,null,null,null,""]
[null,null,null,null,""]
[null,null,null,null,""]
[null,null,null,null,""]
[null,null,null,null,""]
[null,null,null,null,""]
[null,null,null,null,{"$f":"IF(C141=\"\",\"\",IF(D141=\"\",\"\",D141-C141))","v":""}]
[null,null,null,null,""]
[null,null,null,null,""]
[null,null,null,null,""]
[null,null,null,null,""]
[null,null,null,null,""]
[null,null,null,null,""]
[null,null,null,null,""]
[null,null,null,null,""]
[null,null,null,null,""]
[null,null,null,null,""]
[null,null,null,null,""]
[null,null,null,null,""]
[null,null,null,null,""]
[null,null,null,null,""]
[null,null,null,null,""]
[null,null,null,null,""]
[null,null,null,null,""]
[null,null,null,null,""]
[null,null,null,null,""]
[null,null,null,null,""]
[null,null,null,null,""]
[null,null,null,null,""]
[null,null,null,null,""]
[null,null,null,null,""]
[null,null,null,null,""]
[null,null,null,null,""]
[null,null,null,null,""]
[null,null,null,null,""]
[null,null,null,null,""]
[null,null,null,null,""]
[null,null,null,null,""]
[null,null,null,null,""]
[null,null,null,null,""]
[null,null,null,null,""]
[null,null,null,null,""]
[null,null,null,null,""]
[null,null,null,null,""]
[null,null,null,null,""]
[null,null,null,null,""]
[null,null,null,null,""]
[null,null,null,null,""]
[null,null,null,null,""]
[null,null,null,null,""]
[null,null,null,null,""]
[null,null,null,null,""]
[null,null,null,null,""]
[null,null,null,null,""]
[null,null,null,null,""]
[null,null,null,null,""]
[null,null,null,null,""]
[null,null,null,null,""]
[null,null,null,null,""]
[null,null,null,null,""]
[null,null,null,null,""]
[null,null,null,null,""]
[null,null,null,null,""]
[null,null,null,null,""]
[null,null,null,null,""]
[null,null,null,null,""]
[null,null,null,null,""]
[null,null,null,null,""]
[null,null,null,null,""]
[null,null,null,null,""]
[null,null,null,null,{"$f":"IF(C205=\"\",\"\",IF(D205=\"\",\"\",D205-C205))","v":""}]
[null,null,null,null,""]
[null,null,null,null,""]
[null,null,null,null,""]
[null,null,null,null,""]
[null,null,null,null,""]
[null,null,null,null,""]
[null,null,null,null,""]
[null,null,null,null,""]
[null,null,null,null,""]
[null,null,null,null,""]
[null,null,null,null,""]
[null,null,null,null,""]
[null,null,null,null,""]
[null,null,null,null,""]
[null,null,null,null,""]
[null,null,null,null,""]
[null,null,null,null,""]
[null,null,null,null,""]
[null,null,null,null,""]
[null,null,null,null,""]
[null,null,null,null,""]
[null,null,null,null,""]
[null,null,null,null,""]
[null,null,null,null,""]
[null,null,null,null,""]
[null,null,null,null,""]
[null,null,null,null,""]
[null,null,null,null,""]
[null,null,null,null,""]
[null,null,null,null,""]
[null,null,null,null,""]
[null,null,null,null,""]
[null,null,null,null,""]
[null,null,null,null,""]
[null,null,null,null,""]
[null,null,null,null,""]
[null,null,null,null,""]
[null,null,null,null,""]
[null,null,null,null,""]
[null,null,null,null,""]
[null,null,null,null,""]
[null,null,null,null,""]
[null,null,null,null,""]
[null,null,null,null,""]
[null,null,null,null,""]
[null,null,null,null,""]
[null,null,null,null,""]
[null,null,null,null,""]
[null,null,null,null,""]
[null,null,null,null,""]
[null,null,null,null,""]
[null,null,null,null,""]
[null,null,null,null,""]
[null,null,null,null,""]
[null,null,null,null,""]
[null,null,null,null,""]
[null,null,null,null,""]
[null,null,null,null,""]
[null,null,null,null,""]
[null,null,null,null,""]
[null,null,null,null,""]
[null,null,null,null,""]
[null,null,null,null,""]
[null,null,null,null,{"$f":"IF(C269=\"\",\"\",IF(D269=\"\",\"\",D269-C269))","v":""}]
[null,null,null,null,""]
[null,null,null,null,""]
[null,null,null,null,""]
[null,null,null,null,""]
[null,null,null,null,""]
[null,null,null,null,""]
[null,null,null,null,""]
[null,null,null,null,""]
[null,null,null,null,""]
[null,null,null,null,""]
[null,null,null,null,""]
[null,null,null,null,""]
[null,null,null,null,""]
[null,null,null,null,""]
[null,null,null,null,""]
[null,null,null,null,""]
[null,null,null,null,""]
[null,null,null,null,""]
[null,null,null,null,""]
[null,null,null,null,""]
[null,null,null,null,""]
[null,null,null,null,""]
[null,null,null,null,""]
[null,null,null,null,""]
[null,null,null,null,""]
[null,null,null,null,""]
[null,null,null,null,""]
[null,null,null,null,""]
[null,null,null,null,""]
[null,null,null,null,""]
[null,null,null,null,""]
[null,null,null,null,""]
[null,null,null,null,""]
[null,null,null,null,""]
[null,null,null,null,""]
[null,null,null,null,""]
[null,null,null,null,""]
[null,null,null,null,""]
[null,null,null,null,""]
[null,null,null,null,""]
[null,null,null,null,""]
[null,null,null,null,""]
[null,null,null,null,""]
[null,null,null,null,""]
[null,null,null,null,""]
[null,null,null,null,""]
[null,null,null,null,""]
[null,null,null,null,""]
[null,null,null,null,""]
[null,null,null,null,""]
[null,null,null,null,""]
[null,null,null,null,""]
[null,null,null,null,""]
[null,null,null,null,""]
[null,null,null,null,""]
[null,null,null,null,""]
[null,null,null,null,""]
[null,null,null,null,""]
[null,null,null,null,""]
[null,null,null,null,""]
[null,null,null,null,""]
[null,null,null,null,""]
[null,null,null,null,""]
[null,null,null,null,{"$f":"IF(C333=\"\",\"\",IF(D333=\"\",\"\",D333-C333))","v":""}]
[null,null,null,null,""]
[null,null,null,null,""]
[null,null,null,null,""]
[null,null,null,null,""]
[null,null,null,null,""]
[null,null,null,null,""]
[null,null,null,null,""]
[null,null,null,null,""]
[null,null,null,null,""]
[null,null,null,null,""]
[null,null,null,null,""]
[null,null,null,null,""]
[null,null,null,null,""]
[null,null,null,null,""]
[null,null,null,null,""]
[null,null,null,null,""]
[null,null,null,null,""]
[null,null,null,null,""]
[null,null,null,null,""]
[null,null,null,null,""]
[null,null,null,null,""]
[null,null,null,null,""]
[null,null,null,null,""]
[null,null,null,null,""]
[null,null,null,null,""]
[null,null,null,null,""]
[null,null,null,null,""]
[null,null,null,null,""]
[null,null,null,null,""]
[null,null,null,null,""]
[null,null,null,null,""]
[null,null,null,null,""]
[null,null,null,null,""]
[null,null,null,null,""]
[null,null,null,null,""]
[null,null,null,null,""]
[null,null,null,null,""]
[null,null,null,null,""]
[null,null,null,null,""]
[null,null,null,null,""]
[null,null,null,null,""]
[null,null,null,null,""]
[null,null,null,null,""]
[null,null,null,null,""]
[null,null,null,null,""]
[null,null,null,null,""]
[null,null,null,null,""]
[null,null,null,null,""]
[null,null,null,null,""]
[null,null,null,null,""]
[null,null,null,null,""]
[null,null,null,null,""]
[null,null,null,null,""]
[null,null,null,null,""]
[null,null,null,null,""]
[null,null,null,null,""]
[null,null,null,null,""]
[null,null,null,null,""]
[null,null,null,null,""]
[null,null,null,null,""]
[null,null,null,null,""]
[null,null,null,null,""]
[null,null,null,null,""]
[null,null,null,null,{"$f":"IF(C397=\"\",\"\",IF(D397=\"\",\"\",D397-C397))","v":""}]
[null,null,null,null,""]
[null,null,null,null,""]
[null,null,null,null,""]
{"$rows_left_out":105}
{"sheet":"Reports","index":2,"n_rows":118,"n_cols":29,"rows_kept":118,"cut":false,"hidden":true,"merged":[]}
[null,null,null,null,null,null,null,"Workload","Column Labels",null,null,null,null,null,null,null,null,"Days","(All)"]
[null,null,null,null,null,null,null,"Row Labels","Complete","In Progress","Not Started","Overdue","(blank)","Grand Total"]
[null,null,null,null,null,null,null,"Everyone",null,null,null,null,1,1,null,null,null,null,"Column Labels"]
[null,null,null,null,null,null,null,"Jenny Smith",1,null,1,null,null,2,null,null,null,null,"Create Guest List","Create Invitations","Finalize other Hires","Hire Event Coordinator","Plan Event Details","Purchase Invitation Gift","Purchase Required Items","Send Invitations","Send Reminders","Grand Total"]
[null,null,null,null,null,null,null,"Stacy Williams",1,null,3,1,null,5,null,null,null,"Sum of Days",1,4,25,11,18,6,7,3,3,78]
[null,null,null,null,null,null,null,"Bozo the Clown",3,1,null,null,null,4]
[null,null,null,null,null,null,null,"Grand Total",5,1,4,1,1,12]
[]
[]
[]
[]
["Row Labels","Count of Tasks"]
["Complete",5]
["In Progress",1]
["Not Started",4]
["Overdue",1]
["Grand Total",11]
[]
[]
[]
[]
[]
[]
[]
[]
[]
[]
[]
[]
[]
["Actual Cost","(All)"]
[]
["Row Labels","Actual"]
["Choose Event Time"]
["Create Guest List"]
["Create Invitations"]
["Finalize other Hires",310]
["Hire Event Coordinator",200]
["Lock in Guest List"]
["PARTY!"]
["Plan Event Details"]
["Purchase Invitation Gift",290]
["Purchase Required Items",280]
["Send Invitations",8]
["Send Reminders"]
["(blank)"]
["Grand Total",1088]
[]
[]
[]
[]
[]
[]
[]
[]
[]
[]
[]
[]
[]
[]
[]
[]
[]
[]
[]
[]
[]
[]
[]
[]
[]
[]
[]
[]
[]
[]
[]
[]
[]
[]
[]
[]
[]
[]
[]
[]
[]
[]
[]
[]
[]
[]
[]
[]
[]
[]
[]
[]
[]
[]
[]
[]
[]
[]
[]
[]
[]
[]
[]
[]
[]
[]
[null,null,null,null,null,null,null,null,null,null,null,null,null,null,null,null,null,null,null,null,null,null,null,null,null,null,null,"Status List"]
[null,null,null,null,null,null,null,null,null,null,null,null,null,null,null,null,null,null,null,null,null,null,null,null,null,null,null,"Not Started",{"$f":"COUNTIF(Table1[Status],Reports!AB115)","v":4}]
[null,null,null,null,null,null,null,null,null,null,null,null,null,null,null,null,null,null,null,null,null,null,null,null,null,null,null,"In Progress",{"$f":"COUNTIF(Table1[Status],Reports!AB116)","v":1}]
[null,null,null,null,null,null,null,null,null,null,null,null,null,null,null,null,null,null,null,null,null,null,null,null,null,null,null,"Complete",{"$f":"COUNTIF(Table1[Status],Reports!AB117)","v":5}]
[null,null,null,null,null,null,null,null,null,null,null,null,null,null,null,null,null,null,null,null,null,null,null,null,null,null,null,"Overdue",{"$f":"COUNTIF(Table1[Status],Reports!AB118)","v":1}]

{"sheet":"How to use this template","index":3,"n_rows":16,"n_cols":1,"rows_kept":16,"cut":false,"hidden":false,"merged":[]}
["How to use this template:"]
[]
["ProjectManager.com has created this Excel template to help you generate easy reports with simple-to-update task lists, "]
["budget tracker, workload view and progress tracker in one! "]
[]
["Simply click into the cells you'd like to change to update the data, and the formulas take care of the rest. "]
[]
["Be sure to click the \"Update Reports\" button on the Reporting tab to re-populate the reports with the changes you've made."]
[]
["Finally, you should make sure you have \"macros enabled\" so that the formulas can work properly."]
[]
["You can find more templates in our Resources section online."]
[]
["And, of course, if you can update this Excel template, you can manage projects online, too! "]
[]
["Click here to start your free trial at ProjectManager.com:"]